Reaction Details
TargetSerine/threonine-protein kinase TBK1
LigandBDBM276958
Substrate/Competitorn/a
Meas. Tech.Biological Assay for TBK1 and IKKepsilon
IC50 1.09±n/a nM
Citation Du, ZGuerrero, JAKaplan, JAKnox, Jr., JENaduthambi, DPhillips, BWVenkataramani, CWang, PWatkins, WJZablocki, J Tank-binding kinase inhibitor compounds US Patent US10259811 Publication Date 4/16/2019
 
Serine/threonine-protein kinase TBK1
Name:Serine/threonine-protein kinase TBK1
Type:protein
Mol. Mass.:83645.20
Organism:Homo sapiens (Human)
Description:Q9UHD2
Residue:729
BDBM276958
NameBDBM276958
Synonyms:US10072001, Example 134 | US10259811, Example 134
TypeSmall organic molecule
Emp. Form.C31H32N6O5
Mol. Mass.568.623
SMILESCOc1cc(ccc1N1CCN(CC1)C(=O)CO)-c1cc2c(ncnc2[nH]1)-c1ccc(OC2CCOCC2)c(c1)C#N