Reaction Details
TargetInhibitor of nuclear factor kappa-B kinase subunit epsilon
LigandBDBM276984
Substrate/Competitorn/a
Meas. Tech.Biological Assay for TBK1 and IKKepsilon
IC50 2.33±n/a nM
Citation Du, ZGuerrero, JAKaplan, JAKnox, Jr., JENaduthambi, DPhillips, BWVenkataramani, CWang, PWatkins, WJZablocki, J Tank-binding kinase inhibitor compounds US Patent US10259811 Publication Date 4/16/2019
 
Inhibitor of nuclear factor kappa-B kinase subunit epsilon
Name:Inhibitor of nuclear factor kappa-B kinase subunit epsilon
Type:Serine/threonine-protein kinase
Mol. Mass.:80475.98
Organism:Homo sapiens (Human)
Description:Kinase inhibitory activity was determined using recombinant human IKK-epsilon expressed in baculovirus as a FLAG-tagged fusion protein.
Residue:716
BDBM276984
NameBDBM276984
Synonyms:US10072001, Example 160 | US10259811, Example 160
TypeSmall organic molecule
Emp. Form.C31H30N6O5
Mol. Mass.566.6071
SMILESOCC(=O)N1CCC(CC1)Oc1ccc(cc1C#N)-c1ncnc2[nH]c(cc12)-c1ccc(cc1)C(=O)N1CCOCC1