Reaction Details
TargetInhibitor of nuclear factor kappa-B kinase subunit epsilon
LigandBDBM277076
Substrate/Competitorn/a
Meas. Tech.Biological Assay for TBK1 and IKKepsilon
IC50 2.25±n/a nM
Citation Du, ZGuerrero, JAKaplan, JAKnox, Jr., JENaduthambi, DPhillips, BWVenkataramani, CWang, PWatkins, WJZablocki, J Tank-binding kinase inhibitor compounds US Patent US10259811 Publication Date 4/16/2019
 
Inhibitor of nuclear factor kappa-B kinase subunit epsilon
Name:Inhibitor of nuclear factor kappa-B kinase subunit epsilon
Type:Serine/threonine-protein kinase
Mol. Mass.:80475.98
Organism:Homo sapiens (Human)
Description:Kinase inhibitory activity was determined using recombinant human IKK-epsilon expressed in baculovirus as a FLAG-tagged fusion protein.
Residue:716
BDBM277076
NameBDBM277076
Synonyms:US10072001, Example 268 | US10259811, Example 268
TypeSmall organic molecule
Emp. Form.C30H30F2N8O2
Mol. Mass.572.6084
SMILESCN1CCN(CC1)c1ccc(cc1)-c1nc2c(ncnc2[nH]1)-c1ccc(OC2CCN(CC2)C(=O)C(F)F)c(c1)C#N