Reaction Details
TargetSerine/threonine-protein kinase TBK1
LigandBDBM277076
Substrate/Competitorn/a
Meas. Tech.Biological Assay for TBK1 and IKKepsilon
IC50 3.92±n/a nM
Citation Du, ZGuerrero, JAKaplan, JAKnox, Jr., JENaduthambi, DPhillips, BWVenkataramani, CWang, PWatkins, WJZablocki, J Tank-binding kinase inhibitor compounds US Patent US10259811 Publication Date 4/16/2019
 
Serine/threonine-protein kinase TBK1
Name:Serine/threonine-protein kinase TBK1
Type:protein
Mol. Mass.:83645.20
Organism:Homo sapiens (Human)
Description:Q9UHD2
Residue:729
BDBM277076
NameBDBM277076
Synonyms:US10072001, Example 268 | US10259811, Example 268
TypeSmall organic molecule
Emp. Form.C30H30F2N8O2
Mol. Mass.572.6084
SMILESCN1CCN(CC1)c1ccc(cc1)-c1nc2c(ncnc2[nH]1)-c1ccc(OC2CCN(CC2)C(=O)C(F)F)c(c1)C#N