Reaction Details
TargetA disintegrin and metalloproteinase with thrombospondin motifs 5
LigandBDBM24082
Substrate/CompetitorBDBM2
Meas. Tech.Kinesin ATPase In Vitro Assay
pH7±n/a
Temperature296.15±n/a K
IC50 552±n/a nM
Citation Cox, CDTorrent, MBreslin, MJMariano, BJWhitman, DBColeman, PJBuser, CAWalsh, ESHamilton, KSchaber, MDLobell, RBTao, WSouth, VJKohl, NEYan, YKuo, LCPrueksaritanont, TSlaughter, DELi, CMahan, ELu, BHartman, GD Kinesin spindle protein (KSP) inhibitors. Part 4: Structure-based design of 5-alkylamino-3,5-diaryl-4,5-dihydropyrazoles as potent, water-soluble inhibitors of the mitotic kinesin KSP. Bioorg Med Chem Lett16:3175-9 (2006) 
 
A disintegrin and metalloproteinase with thrombospondin motifs 5
Name:A disintegrin and metalloproteinase with thrombospondin motifs 5
Type:Enzyme
Mol. Mass.:101769.09
Organism:Homo sapiens (Human)
Description:Q9UNA0
Residue:930
BDBM24082
BDBM2
NameBDBM24082
Synonyms:3,5-diaryl-4,5-dihydropyrazole, 9g | N-{4-[3-(2,5-difluorophenyl)-1-(ethylcarbamoyl)-5-phenyl-4,5-dihydro-1H-pyrazol-5-yl]butyl}-1H-imidazole-2-carboxamide
TypeSmall organic molecule
Emp. Form.C26H28F2N6O2
Mol. Mass.494.5363
SMILESCCNC(=O)N1N=C(CC1(CCCCNC(=O)c1ncc[nH]1)c1ccccc1)c1cc(F)ccc1F