Reaction Details
TargetHistone deacetylase 1
LigandBDBM24620
Substrate/CompetitorBDBM24619
Meas. Tech.HDAC Inhibition Assay
pH7.4±n/a
Temperature295.15±n/a K
Ki 6±n/a nM
Citation Buggy, JJCao, ZABass, KEVerner, EBalasubramanian, SLiu, LSchultz, BEYoung, PRDalrymple, SA CRA-024781: a novel synthetic inhibitor of histone deacetylase enzymes with antitumor activity in vitro and in vivo. Mol Cancer Ther5:1309-17 (2006) 
 
Histone deacetylase 1
Name:Histone deacetylase 1
Type:Enzyme
Mol. Mass.:55090.27
Organism:Homo sapiens (Human)
Description:Q13547
Residue:482
BDBM24620
BDBM24619
NameBDBM24620
Synonyms:CG-002 | N-{2-[4-(hydroxycarbamoyl)phenoxy]ethyl}naphthalene-2-carboxamide
TypeSmall organic molecule
Emp. Form.C20H18N2O4
Mol. Mass.350.3679
SMILESONC(=O)c1ccc(OCCNC(=O)c2ccc3ccccc3c2)cc1