Reaction Details
TargetHistone deacetylase 6
LigandBDBM24622
Substrate/CompetitorBDBM24619
Meas. Tech.HDAC Inhibition Assay
pH7.4±n/a
Temperature295.15±n/a K
Ki 17±2 nM
Citation Buggy, JJCao, ZABass, KEVerner, EBalasubramanian, SLiu, LSchultz, BEYoung, PRDalrymple, SA CRA-024781: a novel synthetic inhibitor of histone deacetylase enzymes with antitumor activity in vitro and in vivo. Mol Cancer Ther5:1309-17 (2006) 
 
Histone deacetylase 6
Name:Histone deacetylase 6
Type:Chromatin regulator; hydrolase; repressor
Mol. Mass.:131381.51
Organism:Homo sapiens (Human)
Description:Q9UBN7
Residue:1215
BDBM24622
BDBM24619
NameBDBM24622
Synonyms:3-[(dimethylamino)methyl]-N-{2-[4-(hydroxycarbamoyl)phenoxy]ethyl}-1-benzofuran-2-carboxamide | CRA-024781
TypeSmall organic molecule
Emp. Form.C21H23N3O5
Mol. Mass.397.4244
SMILESCN(C)Cc1c(oc2ccccc12)C(=O)NCCOc1ccc(cc1)C(=O)NO