Reaction Details
TargetPhosphatidylinositol 4,5-bisphosphate 3-kinase catalytic subunit gamma isoform/Phosphoinositide 3-kinase regulatory subunit 5
LigandBDBM25061
Substrate/CompetitorBDBM15235
Meas. Tech.PI3Kgamma Inhibition Assay
pH7.4±n/a
Temperature303.15±n/a K
IC50 2.42±n/a nM
Citation Lanni, TBGreene, KLKolz, CNPara, KSVisnick, MMobley, JLDudley, DTBaginski, TJLiimatta, MB Design and synthesis of phenethyl benzo[1,4]oxazine-3-ones as potent inhibitors of PI3Kinasegamma. Bioorg Med Chem Lett17:756-60 (2007) 
 
Phosphatidylinositol 4,5-bisphosphate 3-kinase catalytic subunit gamma isoform/Phosphoinositide 3-kinase regulatory subunit 5
Name:Phosphatidylinositol 4,5-bisphosphate 3-kinase catalytic subunit gamma isoform/Phosphoinositide 3-kinase regulatory subunit 5
Type:Protein Complex
Mol. Mass.:n/a
Description:Heterodimer of a catalytic subunit (PIK3CG/p120) and a regulatory (PIK3R5a/p101) subunit.
Components:This complex has 2 components.
Component 1
Name:Phosphatidylinositol 4,5-bisphosphate 3-kinase catalytic subunit gamma isoform
Synonyms:PI3-kinase p110 subunit gamma PI3Kgamma PK3CG_HUMAN Phosphatidylinositol 4,5-bisphosphate 3-kinase (PI3K) Phosphatidylinositol 4,5-bisphosphate 3-kinase catalytic subunit gamma (PI3Kgamma) Phosphatidylinositol 4,5-bisphosphate 3-kinase catalytic subunit gamma isoform (PI3K) Phosphatidylinositol-4,5-bisphosphate 3-kinase catalytic subunit gamma isoform Phosphoinositide 3-kinases gamma (PI3K gamma) p120-PI3K
Type:Enzyme Subunit
Mol. Mass.:126470.30
Organism:Homo sapiens (Human)
Description:P48736
Residue:1102
Component 2
Name:Phosphoinositide 3-kinase regulatory subunit 5
Synonyms:IB PI3-kinase p101 subunit PI3R5_HUMAN Phosphatidylinositol-4,5-bisphosphate 3-kinase regulatory subunit Phosphoinositide 3-kinase regulatory subunit 5 p101-PI3K
Type:Enzyme Subunit
Mol. Mass.:97349.51
Organism:Homo sapiens (Human)
Description:Phosphoinositide 3-kinase regulatory subunit 5, p101-PI3K.
Residue:880
BDBM25061
BDBM15235
NameBDBM25061
Synonyms:4-[(4-tert-butylphenyl)methyl]-6-{[(5Z)-4-oxo-2-sulfanylidene-1,3-thiazolidin-5-ylidene]methyl}-3,4-dihydro-2H-1,4-benzoxazin-3-one | benzo[1,4]oxazin-3-one, 10c
TypeSmall organic molecule
Emp. Form.C23H22N2O3S2
Mol. Mass.438.562
SMILESCC(C)(C)c1ccc(CN2C(=O)COc3ccc(\C=C4/SC(=S)NC4=O)cc23)cc1