Reaction Details
TargetCathepsin S
LigandBDBM25138
Substrate/CompetitorBDBM19963
Meas. Tech.Enzyme Inhibition Assay
pH7±n/a
Temperature295.15±n/a K
IC50 5±n/a nM
Citation Irie, OKosaka, TEhara, TYokokawa, FKanazawa, THirao, HIwasaki, ASakaki, JTeno, NHitomi, YIwasaki, GFukaya, HNonomura, KTanabe, KKoizumi, SUchiyama, NBevan, SJMalcangio, MGentry, CFox, AJYaqoob, MCulshaw, AJ Discovery of orally bioavailable cathepsin S inhibitors for the reversal of neuropathic pain. J Med Chem51:5502-5 (2008) 
 
Cathepsin S
Name:Cathepsin S
Type:Protein
Mol. Mass.:37507.38
Organism:Homo sapiens (Human)
Description:P25774
Residue:331
BDBM25138
BDBM19963
NameBDBM25138
Synonyms:2-cyano-pyrropyrimidine, 7d | 7-(2-cyclopentylethyl)-6-[4-(4-acetylpiperazin-1-yl)phenoxymethyl]-7H-pyrrolo[2,3-d]pyrimidine-2-carbonitrile
TypeSmall organic molecule
Emp. Form.C27H32N6O2
Mol. Mass.472.582
SMILESCC(=O)N1CCN(CC1)c1ccc(OCc2cc3cnc(nc3n2CCC2CCCC2)C#N)cc1