Reaction Details
TargetSteroid 17-alpha-hydroxylase/17,20 lyase
LigandBDBM25456
Substrate/CompetitorBDBM8903
Meas. Tech.CYP17 Inhibition Assay
pH7.4±n/a
Temperature310.15±n/a K
IC50 144±n/a nM
Citation Pinto-Bazurco Mendieta, MANegri, MJagusch, CMüller-Vieira, ULauterbach, THartmann, RW Synthesis, biological evaluation, and molecular modeling of abiraterone analogues: novel CYP17 inhibitors for the treatment of prostate cancer. J Med Chem51:5009-18 (2008) 
 
Steroid 17-alpha-hydroxylase/17,20 lyase
Name:Steroid 17-alpha-hydroxylase/17,20 lyase
Type:Enzyme
Mol. Mass.:57382.42
Organism:Homo sapiens (Human)
Description:E.coli expressing human CYP17
Residue:508
BDBM25456
BDBM8903
NameBDBM25456
Synonyms:4-[5-(pyridin-4-yl)-5,6,7,8-tetrahydronaphthalen-2-yl]benzene-1,2-diol | Abiraterone mimetic, 19
TypeSmall organic molecule
Emp. Form.C21H19NO2
Mol. Mass.317.3811
SMILESOc1ccc(cc1O)-c1ccc2C(CCCc2c1)c1ccncc1