Reaction Details
TargetCytochrome P450 2D6
LigandBDBM26468
Substrate/CompetitorBDBM26482
Meas. Tech.Homogeneous Time-Resolved Fluorescence (HTRF) Enzyme Assay
IC50 6300±n/a nM
Citation Harris, PABoloor, ACheung, MKumar, RCrosby, RMDavis-Ward, RGEpperly, AHHinkle, KWHunter, RNJohnson, JHKnick, VBLaudeman, CPLuttrell, DKMook, RANolte, RTRudolph, SKSzewczyk, JRTruesdale, ATVeal, JMWang, LStafford, JA Discovery of 5-[[4-[(2,3-dimethyl-2H-indazol-6-yl)methylamino]-2-pyrimidinyl]amino]-2-methyl-benzenesulfonamide (Pazopanib), a novel and potent vascular endothelial growth factor receptor inhibitor. J Med Chem51:4632-40 (2008) 
 
Cytochrome P450 2D6
Name:Cytochrome P450 2D6
Type:Protein
Mol. Mass.:55774.82
Organism:Homo sapiens (Human)
Description:P10635
Residue:497
BDBM26468
BDBM26482
NameBDBM26468
Synonyms:3-({4-[(1,3-dimethyl-1H-indazol-6-yl)(methyl)amino]pyrimidin-2-yl}amino)benzene-1-sulfonamide | 3-aminobenzene sulfonamide, 12b
TypeSmall organic molecule
Emp. Form.C20H21N7O2S
Mol. Mass.423.491
SMILESCN(c1ccc2c(C)nn(C)c2c1)c1ccnc(Nc2cccc(c2)S(N)(=O)=O)n1