Reaction Details
TargetCytochrome P450 3A4
LigandBDBM26473
Substrate/CompetitorBDBM26483
Meas. Tech.Homogeneous Time-Resolved Fluorescence (HTRF) Enzyme Assay
IC50 45000±n/a nM
Citation Harris, PABoloor, ACheung, MKumar, RCrosby, RMDavis-Ward, RGEpperly, AHHinkle, KWHunter, RNJohnson, JHKnick, VBLaudeman, CPLuttrell, DKMook, RANolte, RTRudolph, SKSzewczyk, JRTruesdale, ATVeal, JMWang, LStafford, JA Discovery of 5-[[4-[(2,3-dimethyl-2H-indazol-6-yl)methylamino]-2-pyrimidinyl]amino]-2-methyl-benzenesulfonamide (Pazopanib), a novel and potent vascular endothelial growth factor receptor inhibitor. J Med Chem51:4632-40 (2008) 
 
Cytochrome P450 3A4
Name:Cytochrome P450 3A4
Type:Enzyme
Mol. Mass.:57349.57
Organism:Homo sapiens (Human)
Description:n/a
Residue:503
BDBM26473
BDBM26483
NameBDBM26473
Synonyms:3-({4-[(1,2-dimethyl-1H-1,3-benzodiazol-5-yl)(methyl)amino]pyrimidin-2-yl}amino)benzene-1-sulfonamide | 3-aminobenzene sulfonamide, 12g
TypeSmall organic molecule
Emp. Form.C20H21N7O2S
Mol. Mass.423.491
SMILESCN(c1ccc2n(C)c(C)nc2c1)c1ccnc(Nc2cccc(c2)S(N)(=O)=O)n1