Reaction Details
TargetPlatelet glycoprotein 4
LigandBDBM263256
Substrate/Competitorn/a
Meas. Tech.Receptor Binding Assay with 125I-Ghrelin
pH7.3±n/a
IC50 2950±n/a nM
Commentsextracted
Citation Ong, HChemtob, SLubell, WSennlaub, FBoeglin, DProulx, CSajjadi, ZSabatino, D Azapeptides as CD36 binding compounds US Patent US9708370 Publication Date 7/18/2017
 
Platelet glycoprotein 4
Name:Platelet glycoprotein 4
Type:PROTEIN
Mol. Mass.:52740.95
Organism:Rattus norvegicus
Description:ChEMBL_858884
Residue:472
BDBM263256
NameBDBM263256
Synonyms:US9708370, 67 ZS555-F40 | US9708370, ZS555-F40
TypeSmall organic molecule
Emp. Form.C40H52N10O7
Mol. Mass.784.9037
SMILESC[C@H](N)C(=O)N[C@H](Cc1c[nH]c2ccccc12)C(=O)N[C@@H](C)C(=O)NN(Cc1ccc(O)cc1)C(=O)N[C@H](Cc1ccccc1)C(=O)N[C@@H](CCCCN)C(N)=O