Reaction Details
TargetFatty-acid amide hydrolase 1 [30-579]
LigandBDBM26722
Substrate/CompetitorBDBM22988
Meas. Tech.FAAH Carbon Filtration Assay
pH8±n/a
Temperature295.15±n/a K
IC50 16±2 nM
Citation Wang, XSarris, KKage, KZhang, DBrown, SPKolasa, TSurowy, CEl Kouhen, OFMuchmore, SWBrioni, JDStewart, AO Synthesis and evaluation of benzothiazole-based analogues as novel, potent, and selective fatty acid amide hydrolase inhibitors. J Med Chem52:170-80 (2009) 
 
Fatty-acid amide hydrolase 1 [30-579]
Name:Fatty-acid amide hydrolase 1 [30-579]
Type:Single-pass membrane protein; homodimer
Mol. Mass.:60474.00
Organism:Rattus norvegicus (rat)
Description:P97612 (aa 30-579)
Residue:550
BDBM26722
BDBM22988
NameBDBM26722
Synonyms:4-(6-methyl-1,3-benzothiazol-2-yl)-N-{[1-(thiophene-2-sulfonyl)piperidin-4-yl]methyl}aniline | benzothiazole analogue, 15e
TypeSmall organic molecule
Emp. Form.C24H25N3O2S3
Mol. Mass.483.669
SMILESCc1ccc2nc(sc2c1)-c1ccc(NCC2CCN(CC2)S(=O)(=O)c2cccs2)cc1