Reaction Details
TargetFatty-acid amide hydrolase 1 [30-579]
LigandBDBM26728
Substrate/CompetitorBDBM22988
Meas. Tech.FAAH Carbon Filtration Assay
pH8±n/a
Temperature295.15±n/a K
IC50 15±2 nM
Citation Wang, XSarris, KKage, KZhang, DBrown, SPKolasa, TSurowy, CEl Kouhen, OFMuchmore, SWBrioni, JDStewart, AO Synthesis and evaluation of benzothiazole-based analogues as novel, potent, and selective fatty acid amide hydrolase inhibitors. J Med Chem52:170-80 (2009) 
 
Fatty-acid amide hydrolase 1 [30-579]
Name:Fatty-acid amide hydrolase 1 [30-579]
Type:Single-pass membrane protein; homodimer
Mol. Mass.:60474.00
Organism:Rattus norvegicus (rat)
Description:P97612 (aa 30-579)
Residue:550
BDBM26728
BDBM22988
NameBDBM26728
Synonyms:N-[4-(1,3-benzothiazol-2-yl)phenyl]-1-(thiophene-2-sulfonyl)piperidine-4-carboxamide | benzothiazole analogue, 16a
TypeSmall organic molecule
Emp. Form.C23H21N3O3S3
Mol. Mass.483.626
SMILESO=C(Nc1ccc(cc1)-c1nc2ccccc2s1)C1CCN(CC1)S(=O)(=O)c1cccs1