Reaction Details
TargetSodium channel protein type 5 subunit alpha
LigandBDBM71137
Substrate/Competitorn/a
Meas. Tech.Radioligand Binding Assay (EP) (In vitro Assay)
pH7.4±n/a
Temperature298.15±n/a K
IC50 1.70±n/a nM
Commentsextracted
Citation Andrez, JBichler, PRChen, CChowdhury, SDecker, SMDehnhardt, CMFocken, TGrimwood, MEHemeon, IWJia, QLi, JLiu, ZOrtwine, DFSafina, BSutherlin, DSheng, TSun, SWhite, ADWilson, MSZenova, AYZhu, J Substituted benzamides and methods of use thereof US Patent US9546164 Publication Date 1/17/2017
 
Sodium channel protein type 5 subunit alpha
Name:Sodium channel protein type 5 subunit alpha
Type:Enzyme
Mol. Mass.:226908.60
Organism:Homo sapiens (Human)
Description:Q14524
Residue:2016
BDBM71137
NameBDBM71137
Synonyms:US9546164, 260 | US9694002, 260
TypeSmall organic molecule
Emp. Form.C26H30Cl2FN3O4S
Mol. Mass.570.504
SMILESFc1cc(OCC2CCN(Cc3cc(Cl)cc(Cl)c3)CC2)c(cc1C(=O)NS(=O)(=O)N1CCC1)C1CC1