Reaction Details
TargetSodium channel protein type 5 subunit alpha
LigandBDBM71060
Substrate/Competitorn/a
Meas. Tech.Radioligand Binding Assay (EP) (In vitro Assay)
pH7.4±n/a
Temperature298.15±n/a K
IC50 2.50±n/a nM
Commentsextracted
Citation Andrez, JBichler, PRChen, CChowdhury, SDecker, SMDehnhardt, CMFocken, TGrimwood, MEHemeon, IWJia, QLi, JLiu, ZOrtwine, DFSafina, BSutherlin, DSheng, TSun, SWhite, ADWilson, MSZenova, AYZhu, J Substituted benzamides and methods of use thereof US Patent US9546164 Publication Date 1/17/2017
 
Sodium channel protein type 5 subunit alpha
Name:Sodium channel protein type 5 subunit alpha
Type:Enzyme
Mol. Mass.:226908.60
Organism:Homo sapiens (Human)
Description:Q14524
Residue:2016
BDBM71060
NameBDBM71060
Synonyms:US9546164, 205 | US9694002, 205
TypeSmall organic molecule
Emp. Form.C28H35Cl2FN2O5S
Mol. Mass.601.557
SMILESCOC(C)(C)[C@H](N1CCC(COc2cc(F)c(cc2C2CC2)C(=O)NS(C)(=O)=O)CC1)c1cc(Cl)cc(Cl)c1