Reaction Details
TargetSodium channel protein type 9 subunit alpha
LigandBDBM71064
Substrate/Competitorn/a
Meas. Tech.Electrophysiological Assay (EP) (In vitro Assay)
pH7.2±n/a
IC50 15.8±n/a nM
Commentsextracted
Citation Andrez, JBichler, PRChen, CChowdhury, SDecker, SMDehnhardt, CMFocken, TGrimwood, MEHemeon, IWJia, QLi, JLiu, ZOrtwine, DFSafina, BSutherlin, DSheng, TSun, SWhite, ADWilson, MSZenova, AYZhu, J Substituted benzamides and methods of use thereof US Patent US9546164 Publication Date 1/17/2017
 
Sodium channel protein type 9 subunit alpha
Name:Sodium channel protein type 9 subunit alpha
Type:Protein
Mol. Mass.:226375.97
Organism:Homo sapiens (Human)
Description:Q15858
Residue:1988
BDBM71064
NameBDBM71064
Synonyms:US9546164, 209 | US9694002, 209
TypeSmall organic molecule
Emp. Form.C26H31Cl2FN2O4S
Mol. Mass.557.505
SMILESCC(C)(N1CCC(COc2cc(F)c(cc2C2CC2)C(=O)NS(C)(=O)=O)CC1)c1cc(Cl)cc(Cl)c1