Reaction Details
TargetSodium channel protein type 5 subunit alpha
LigandBDBM71065
Substrate/Competitorn/a
Meas. Tech.Radioligand Binding Assay (EP) (In vitro Assay)
pH7.4±n/a
Temperature298.15±n/a K
IC50 1.90±n/a nM
Commentsextracted
Citation Andrez, JBichler, PRChen, CChowdhury, SDecker, SMDehnhardt, CMFocken, TGrimwood, MEHemeon, IWJia, QLi, JLiu, ZOrtwine, DFSafina, BSutherlin, DSheng, TSun, SWhite, ADWilson, MSZenova, AYZhu, J Substituted benzamides and methods of use thereof US Patent US9546164 Publication Date 1/17/2017
 
Sodium channel protein type 5 subunit alpha
Name:Sodium channel protein type 5 subunit alpha
Type:Enzyme
Mol. Mass.:226908.60
Organism:Homo sapiens (Human)
Description:Q14524
Residue:2016
BDBM71065
NameBDBM71065
Synonyms:US9546164, 210 | US9694002, 210
TypeSmall organic molecule
Emp. Form.C27H33Cl2FN2O4S
Mol. Mass.571.531
SMILESCCS(=O)(=O)NC(=O)c1cc(C2CC2)c(OCC2CCN(CC2)C(C)(C)c2cc(Cl)cc(Cl)c2)cc1F