Reaction Details
TargetSodium channel protein type 5 subunit alpha
LigandBDBM71464
Substrate/Competitorn/a
Meas. Tech.Electrophysiological Assay (EP) (In vitro Assay)
pH7.2±n/a
IC50 15.4±n/a nM
Commentsextracted
Citation Andrez, JBichler, PRChen, CChowdhury, SDecker, SMDehnhardt, CMFocken, TGrimwood, MEHemeon, IWJia, QLi, JLiu, ZOrtwine, DFSafina, BSutherlin, DSheng, TSun, SWhite, ADWilson, MSZenova, AYZhu, J Substituted benzamides and methods of use thereof US Patent US9546164 Publication Date 1/17/2017
 
Sodium channel protein type 5 subunit alpha
Name:Sodium channel protein type 5 subunit alpha
Type:Enzyme
Mol. Mass.:226908.60
Organism:Homo sapiens (Human)
Description:Q14524
Residue:2016
BDBM71464
NameBDBM71464
Synonyms:US9546164, 495 | US9694002, 495
TypeSmall organic molecule
Emp. Form.C27H31Cl2FN2O4S
Mol. Mass.569.515
SMILESCC(C)(N1CCC[C@H](C1)Oc1cc(F)c(cc1C1CC1)C(=O)NS(=O)(=O)C1CC1)c1cc(Cl)cc(Cl)c1