Reaction Details
TargetTyrosine-protein kinase BTK
LigandBDBM263528
Substrate/Competitorn/a
Meas. Tech.TR-FRET (Time Resolved FRET) Assay
pH7.15±n/a
IC50 3.60±0 nM
Commentsextracted
Citation Lopez-Tapia, FJKong, NSo, SLou, YDominique, R Inhibitors of bruton's tyrosine kinase US Patent US9556150 Publication Date 1/31/2017
 
Tyrosine-protein kinase BTK
Name:Tyrosine-protein kinase BTK
Type:Enzyme
Mol. Mass.:76289.95
Organism:Homo sapiens (Human)
Description:Q06187
Residue:659
BDBM263528
NameBDBM263528
Synonyms:(2-{5-amino-1-[4-(3-chloro- phenoxy)-2-methyl-phenyl]-1h- pyrazole-4-carbonyl}-1h-indol- 5-yl)-morpholin-4-yl-methanone | US9556150, i-16
TypeSmall organic molecule
Emp. Form.C30H26ClN5O4
Mol. Mass.556.012
SMILESCc1cc(Oc2cccc(Cl)c2)ccc1-n1ncc(C(=O)c2cc3cc(ccc3[nH]2)C(=O)N2CCOCC2)c1N