Reaction Details
TargetTyrosine-protein kinase BTK
LigandBDBM263548
Substrate/Competitorn/a
Meas. Tech.TR-FRET (Time Resolved FRET) Assay
pH7.15±n/a
IC50 5.00±0 nM
Commentsextracted
Citation Lopez-Tapia, FJKong, NSo, SLou, YDominique, R Inhibitors of bruton's tyrosine kinase US Patent US9556150 Publication Date 1/31/2017
 
Tyrosine-protein kinase BTK
Name:Tyrosine-protein kinase BTK
Type:Enzyme
Mol. Mass.:76289.95
Organism:Homo sapiens (Human)
Description:Q06187
Residue:659
BDBM263548
NameBDBM263548
Synonyms:2-{5-amino-1-[4-(3-cyano- phenoxy)-2-methyl-phenyl]-1h- pyrazole-4-carbonyl}-1h-indole- 5-carboxylic acid (2-amino- ethyl)-amide | US9556150, i-36
TypeSmall organic molecule
Emp. Form.C29H25N7O3
Mol. Mass.519.5539
SMILESCc1cc(Oc2cccc(c2)C#N)ccc1-n1ncc(C(=O)c2cc3cc(ccc3[nH]2)C(=O)NCCN)c1N