Reaction Details
TargetTyrosine-protein kinase BTK
LigandBDBM263561
Substrate/Competitorn/a
Meas. Tech.TR-FRET (Time Resolved FRET) Assay
pH7.15±n/a
IC50 1.40±0 nM
Commentsextracted
Citation Lopez-Tapia, FJKong, NSo, SLou, YDominique, R Inhibitors of bruton's tyrosine kinase US Patent US9556150 Publication Date 1/31/2017
 
Tyrosine-protein kinase BTK
Name:Tyrosine-protein kinase BTK
Type:Enzyme
Mol. Mass.:76289.95
Organism:Homo sapiens (Human)
Description:Q06187
Residue:659
BDBM263561
NameBDBM263561
Synonyms:2-{5-amino-1-[2-chloro-4-(2- dimethylcarbamoyl-phenoxy)- phenyl]-1h-pyrazole-4- carbonyl}-1h-indole-5- carboxylic acid (2- dimethylamino-ethyl)-amide | US9556150, i-49
TypeSmall organic molecule
Emp. Form.C32H32ClN7O4
Mol. Mass.614.094
SMILESCN(C)CCNC(=O)c1ccc2[nH]c(cc2c1)C(=O)c1cnn(c1N)-c1ccc(Oc2ccccc2C(=O)N(C)C)cc1Cl