Reaction Details
TargetTyrosine-protein kinase BTK
LigandBDBM263563
Substrate/Competitorn/a
Meas. Tech.TR-FRET (Time Resolved FRET) Assay
pH7.15±n/a
IC50 1.10±0 nM
Commentsextracted
Citation Lopez-Tapia, FJKong, NSo, SLou, YDominique, R Inhibitors of bruton's tyrosine kinase US Patent US9556150 Publication Date 1/31/2017
 
Tyrosine-protein kinase BTK
Name:Tyrosine-protein kinase BTK
Type:Enzyme
Mol. Mass.:76289.95
Organism:Homo sapiens (Human)
Description:Q06187
Residue:659
BDBM263563
NameBDBM263563
Synonyms:2-(4-{5-amino-4-[5-(piperazine- 1-carbonyl)-1h-indole-2- carbonyl]-pyrazol-1-yl}-3- chloro-phenoxy)-n,n-dimethyl- benzamide acetic acid salt | US9556150, i-51
TypeSmall organic molecule
Emp. Form.C32H30ClN7O4
Mol. Mass.612.078
SMILESCN(C)C(=O)c1ccccc1Oc1ccc(c(Cl)c1)-n1ncc(C(=O)c2cc3cc(ccc3[nH]2)C(=O)N2CCNCC2)c1N