Reaction Details
TargetTyrosine-protein kinase BTK
LigandBDBM263570
Substrate/Competitorn/a
Meas. Tech.TR-FRET (Time Resolved FRET) Assay
pH7.15±n/a
IC50 2.10±0 nM
Commentsextracted
Citation Lopez-Tapia, FJKong, NSo, SLou, YDominique, R Inhibitors of bruton's tyrosine kinase US Patent US9556150 Publication Date 1/31/2017
 
Tyrosine-protein kinase BTK
Name:Tyrosine-protein kinase BTK
Type:Enzyme
Mol. Mass.:76289.95
Organism:Homo sapiens (Human)
Description:Q06187
Residue:659
BDBM263570
NameBDBM263570
Synonyms:2-(4-{5-amino-4-[5-(4- methylamino-piperidine-1- carbonyl)-1h-indole-2-carbonyl]- pyrazol-1-yl}-3-chloro-phenoxy)- n,n-dimethyl-benzamide | US9556150, i-58
TypeSmall organic molecule
Emp. Form.C34H34ClN7O4
Mol. Mass.640.131
SMILESCNC1CCN(CC1)C(=O)c1ccc2[nH]c(cc2c1)C(=O)c1cnn(c1N)-c1ccc(Oc2ccccc2C(=O)N(C)C)cc1Cl