Reaction Details
TargetcAMP-dependent protein kinase catalytic subunit alpha
LigandBDBM27236
Substrate/CompetitorBDBM27221
Meas. Tech.Fluorescence Polarization-Based Binding Displacement Kinase Assay
pH7.5±n/a
Temperature303.15±n/a K
Kd 1640±310 nM
Citation Lavogina, DLust, MViil, IKönig, NRaidaru, GRogozina, JEnkvist, EUri, ABossemeyer, D Structural analysis of ARC-type inhibitor (ARC-1034) binding to protein kinase A catalytic subunit and rational design of bisubstrate analogue inhibitors of basophilic protein kinases. J Med Chem52:308-21 (2009) 
 
cAMP-dependent protein kinase catalytic subunit alpha
Name:cAMP-dependent protein kinase catalytic subunit alpha
Type:Enzyme Catalytic Unit
Mol. Mass.:40579.18
Organism:Mus musculus (mouse)
Description:n/a
Residue:351
BDBM27236
BDBM27221
NameBDBM27236
Synonyms:6-{[(2S,3S,4R,5R)-5-(6-amino-9H-purin-9-yl)-3,4-dihydroxyoxolan-2-yl]formamido}-N-(4-aminobutyl)hexanamide | ARC-1008, 10
TypeSmall organic molecule
Emp. Form.C20H32N8O5
Mol. Mass.464.5187
SMILESNCCCCNC(=O)CCCCCNC(=O)[C@H]1O[C@H]([C@H](O)[C@@H]1O)n1cnc2c(N)ncnc12