Reaction Details
TargetcAMP-dependent protein kinase catalytic subunit alpha
LigandBDBM27240
Substrate/CompetitorBDBM27221
Meas. Tech.Fluorescence Polarization-Based Binding Displacement Kinase Assay
pH7.5±n/a
Temperature303.15±n/a K
Kd 1960±320 nM
Citation Lavogina, DLust, MViil, IKönig, NRaidaru, GRogozina, JEnkvist, EUri, ABossemeyer, D Structural analysis of ARC-type inhibitor (ARC-1034) binding to protein kinase A catalytic subunit and rational design of bisubstrate analogue inhibitors of basophilic protein kinases. J Med Chem52:308-21 (2009) 
 
cAMP-dependent protein kinase catalytic subunit alpha
Name:cAMP-dependent protein kinase catalytic subunit alpha
Type:Enzyme Catalytic Unit
Mol. Mass.:40579.18
Organism:Mus musculus (mouse)
Description:n/a
Residue:351
BDBM27240
BDBM27221
NameBDBM27240
Synonyms:6-{[(2S,3S,4R,5R)-5-(6-amino-9H-purin-9-yl)-3,4-dihydroxyoxolan-2-yl]formamido}-N-[(1R)-2-(4-benzoylphenyl)-1-carbamoylethyl]hexanamide | ARC-1014, 14
TypeSmall organic molecule
Emp. Form.C32H36N8O7
Mol. Mass.644.6776
SMILESNC(=O)[C@@H](Cc1ccc(cc1)C(=O)c1ccccc1)NC(=O)CCCCCNC(=O)[C@H]1O[C@H]([C@H](O)[C@@H]1O)n1cnc2c(N)ncnc12