Reaction Details
TargetGlycogen phosphorylase, liver form
LigandBDBM27735
Substrate/CompetitorBDBM24362
Meas. Tech.Human Liver GPa Enzymatic Activity Assay
pH7.6±n/a
Temperature298.15±n/a K
IC50 13±6 nM
Citation Thomson, SABanker, PBickett, DMBoucheron, JACarter, HLClancy, DCCooper, JPDickerson, SHGarrido, DMNolte, RTPeat, AJSheckler, LRSparks, SMTavares, FXWang, LWang, TYWeiel, JE Anthranilimide based glycogen phosphorylase inhibitors for the treatment of type 2 diabetes. Part 3: X-ray crystallographic characterization, core and urea optimization and in vivo efficacy. Bioorg Med Chem Lett19:1177-82 (2009) 
 
Glycogen phosphorylase, liver form
Name:Glycogen phosphorylase, liver form
Type:Homodimer
Mol. Mass.:97153.98
Organism:Homo sapiens (Human)
Description:Dimers associate into a tetramer to form the enzymatically active phosphorylase A.
Residue:847
BDBM27735
BDBM24362
NameBDBM27735
Synonyms:(2S,3R)-3-(tert-butoxy)-2-{[4-(3,4-difluorophenyl)-2-{[(2,4,6-trimethylphenyl)carbamoyl]amino}phenyl]formamido}butanoic acid | anthranilimide based compound, 11
TypeSmall organic molecule
Emp. Form.C31H35F2N3O5
Mol. Mass.567.6235
SMILESC[C@@H](OC(C)(C)C)[C@H](NC(=O)c1ccc(cc1NC(=O)Nc1c(C)cc(C)cc1C)-c1ccc(F)c(F)c1)C(O)=O