Reaction Details
TargetExtracellular calcium-sensing receptor
LigandBDBM27979
Substrate/CompetitorBDBM10852
Meas. Tech.Calcium-Sensing Receptor Antagonist Fluorescence Assay
pH7.5±n/a
Temperature310.15±n/a K
IC50 200±n/a nM
Citation Yang, WRuan, ZWang, YVan Kirk, KMa, ZArey, BJCooper, CBSeethala, RFeyen, JHDickson, JK Discovery and Structure-Activity Relationships of Trisubstituted Pyrimidines/Pyridines as Novel Calcium-Sensing Receptor Antagonists. J Med Chem52:1204-8 (2009) 
 
Extracellular calcium-sensing receptor
Name:Extracellular calcium-sensing receptor
Type:Protein
Mol. Mass.:120663.13
Organism:Homo sapiens (Human)
Description:P41180
Residue:1078
BDBM27979
BDBM10852
NameBDBM27979
Synonyms:2-[benzyl(ethyl)amino]-N-(2-phenoxyethyl)-4-(3,4,5-trimethoxyphenyl)pyrimidine-5-carboxamide | trisubstituted pyrimidine analogue, 1
TypeSmall organic molecule
Emp. Form.C31H34N4O5
Mol. Mass.542.6255
SMILESCCN(Cc1ccccc1)c1ncc(C(=O)NCCOc2ccccc2)c(n1)-c1cc(OC)c(OC)c(OC)c1