Reaction Details
TargetExtracellular calcium-sensing receptor
LigandBDBM27995
Substrate/CompetitorBDBM10852
Meas. Tech.Calcium-Sensing Receptor Antagonist Fluorescence Assay
pH7.5±n/a
Temperature310.15±n/a K
IC50 2800±n/a nM
Citation Yang, WRuan, ZWang, YVan Kirk, KMa, ZArey, BJCooper, CBSeethala, RFeyen, JHDickson, JK Discovery and Structure-Activity Relationships of Trisubstituted Pyrimidines/Pyridines as Novel Calcium-Sensing Receptor Antagonists. J Med Chem52:1204-8 (2009) 
 
Extracellular calcium-sensing receptor
Name:Extracellular calcium-sensing receptor
Type:Protein
Mol. Mass.:120663.13
Organism:Homo sapiens (Human)
Description:P41180
Residue:1078
BDBM27995
BDBM10852
NameBDBM27995
Synonyms:2-{[2-(4-methoxyphenyl)ethyl]amino}-N-(2-phenoxyethyl)-4-(3,4,5-trimethoxyphenyl)pyrimidine-5-carboxamide | trisubstituted pyrimidine analogue, 6p
TypeSmall organic molecule
Emp. Form.C31H34N4O6
Mol. Mass.558.6249
SMILESCOc1ccc(CCNc2ncc(C(=O)NCCOc3ccccc3)c(n2)-c2cc(OC)c(OC)c(OC)c2)cc1