Reaction Details
TargetExtracellular calcium-sensing receptor
LigandBDBM28008
Substrate/CompetitorBDBM10852
Meas. Tech.Calcium-Sensing Receptor Antagonist Fluorescence Assay
pH7.5±n/a
Temperature310.15±n/a K
IC50 18900±n/a nM
Citation Yang, WRuan, ZWang, YVan Kirk, KMa, ZArey, BJCooper, CBSeethala, RFeyen, JHDickson, JK Discovery and Structure-Activity Relationships of Trisubstituted Pyrimidines/Pyridines as Novel Calcium-Sensing Receptor Antagonists. J Med Chem52:1204-8 (2009) 
 
Extracellular calcium-sensing receptor
Name:Extracellular calcium-sensing receptor
Type:Protein
Mol. Mass.:120663.13
Organism:Homo sapiens (Human)
Description:P41180
Residue:1078
BDBM28008
BDBM10852
NameBDBM28008
Synonyms:2-[benzyl(methyl)amino]-N-(2-phenoxyethyl)-4-[4-(trifluoromethyl)phenyl]pyrimidine-5-carboxamide | trisubstituted pyrimidine analogue, 11i
TypeSmall organic molecule
Emp. Form.C28H25F3N4O2
Mol. Mass.506.5189
SMILESCN(Cc1ccccc1)c1ncc(C(=O)NCCOc2ccccc2)c(n1)-c1ccc(cc1)C(F)(F)F