Reaction Details
TargetExtracellular calcium-sensing receptor
LigandBDBM28011
Substrate/CompetitorBDBM10852
Meas. Tech.Calcium-Sensing Receptor Antagonist Fluorescence Assay
IC50 360±n/a nM
Citation Yang, WRuan, ZWang, YVan Kirk, KMa, ZArey, BJCooper, CBSeethala, RFeyen, JHDickson, JK Discovery and Structure-Activity Relationships of Trisubstituted Pyrimidines/Pyridines as Novel Calcium-Sensing Receptor Antagonists. J Med Chem52:1204-8 (2009) 
 
Extracellular calcium-sensing receptor
Name:Extracellular calcium-sensing receptor
Type:Protein
Mol. Mass.:120663.13
Organism:Homo sapiens (Human)
Description:P41180
Residue:1078
BDBM28011
BDBM10852
NameBDBM28011
Synonyms:2-[benzyl(ethyl)amino]-4-(2,6-dimethoxypyridin-3-yl)-N-(2-phenoxyethyl)pyrimidine-5-carboxamide | trisubstituted pyrimidine analogue, 11l
TypeSmall organic molecule
Emp. Form.C29H31N5O4
Mol. Mass.513.5875
SMILESCCN(Cc1ccccc1)c1ncc(C(=O)NCCOc2ccccc2)c(n1)-c1ccc(OC)nc1OC