Reaction Details
TargetExtracellular calcium-sensing receptor
LigandBDBM28012
Substrate/CompetitorBDBM10852
Meas. Tech.Calcium-Sensing Receptor Antagonist Fluorescence Assay
IC50 220±n/a nM
Citation Yang, WRuan, ZWang, YVan Kirk, KMa, ZArey, BJCooper, CBSeethala, RFeyen, JHDickson, JK Discovery and Structure-Activity Relationships of Trisubstituted Pyrimidines/Pyridines as Novel Calcium-Sensing Receptor Antagonists. J Med Chem52:1204-8 (2009) 
 
Extracellular calcium-sensing receptor
Name:Extracellular calcium-sensing receptor
Type:Protein
Mol. Mass.:120663.13
Organism:Homo sapiens (Human)
Description:P41180
Residue:1078
BDBM28012
BDBM10852
NameBDBM28012
Synonyms:2-[(2H-1,3-benzodioxol-5-ylmethyl)amino]-4-(2,6-dimethoxypyridin-3-yl)-N-(2-phenoxyethyl)pyrimidine-5-carboxamide | trisubstituted pyrimidine analogue, 11m
TypeSmall organic molecule
Emp. Form.C28H27N5O6
Mol. Mass.529.5439
SMILESCOc1ccc(c(OC)n1)-c1nc(NCc2ccc3OCOc3c2)ncc1C(=O)NCCOc1ccccc1