Reaction Details
TargetExtracellular calcium-sensing receptor
LigandBDBM28014
Substrate/CompetitorBDBM10852
Meas. Tech.Calcium-Sensing Receptor Antagonist Fluorescence Assay
IC50 150±n/a nM
Citation Yang, WRuan, ZWang, YVan Kirk, KMa, ZArey, BJCooper, CBSeethala, RFeyen, JHDickson, JK Discovery and Structure-Activity Relationships of Trisubstituted Pyrimidines/Pyridines as Novel Calcium-Sensing Receptor Antagonists. J Med Chem52:1204-8 (2009) 
 
Extracellular calcium-sensing receptor
Name:Extracellular calcium-sensing receptor
Type:Protein
Mol. Mass.:120663.13
Organism:Homo sapiens (Human)
Description:P41180
Residue:1078
BDBM28014
BDBM10852
NameBDBM28014
Synonyms:2-[(2H-1,3-benzodioxol-5-ylmethyl)amino]-N-[1-(4-chlorophenyl)propan-2-yl]-4-(2,6-dimethoxypyridin-3-yl)pyrimidine-5-carboxamide | trisubstituted pyrimidine analogue, 11o
TypeSmall organic molecule
Emp. Form.C29H28ClN5O5
Mol. Mass.562.016
SMILESCOc1ccc(c(OC)n1)-c1nc(NCc2ccc3OCOc3c2)ncc1C(=O)NC(C)Cc1ccc(Cl)cc1