Reaction Details
TargetExtracellular calcium-sensing receptor
LigandBDBM28019
Substrate/CompetitorBDBM10852
Meas. Tech.Calcium-Sensing Receptor Antagonist Fluorescence Assay
IC50 130±n/a nM
Citation Yang, WRuan, ZWang, YVan Kirk, KMa, ZArey, BJCooper, CBSeethala, RFeyen, JHDickson, JK Discovery and Structure-Activity Relationships of Trisubstituted Pyrimidines/Pyridines as Novel Calcium-Sensing Receptor Antagonists. J Med Chem52:1204-8 (2009) 
 
Extracellular calcium-sensing receptor
Name:Extracellular calcium-sensing receptor
Type:Protein
Mol. Mass.:120663.13
Organism:Homo sapiens (Human)
Description:P41180
Residue:1078
BDBM28019
BDBM10852
NameBDBM28019
Synonyms:6-[(2H-1,3-benzodioxol-5-ylmethyl)amino]-N-(2-phenoxyethyl)-2-(3,4,5-trimethoxyphenyl)pyridine-3-carboxamide | trisubstituted pyridine analogue, 18e
TypeSmall organic molecule
Emp. Form.C31H31N3O7
Mol. Mass.557.5937
SMILESCOc1cc(cc(OC)c1OC)-c1nc(NCc2ccc3OCOc3c2)ccc1C(=O)NCCOc1ccccc1