Reaction Details
TargetNitric oxide synthase, inducible
LigandBDBM29267
Substrate/CompetitorBDBM10852
Meas. Tech.Cell-Based NOS Transient Transfection Assay
Temperature298.15±n/a K
EC50 53±n/a nM
Commentsextracted
Citation Bonnefous, CPayne, JERoppe, JZhuang, HChen, XSymons, KTNguyen, PMSablad, MRozenkrants, NZhang, YWang, LSeverance, DWalsh, JPYazdani, NShiau, AKNoble, SARix, PRao, TSHassig, CASmith, ND Discovery of inducible nitric oxide synthase (iNOS) inhibitor development candidate KD7332, part 1: Identification of a novel, potent, and selective series of quinolinone iNOS dimerization inhibitors that are orally active in rodent pain models. J Med Chem52:3047-62 (2009) 
 
Nitric oxide synthase, inducible
Name:Nitric oxide synthase, inducible
Type:Homodimer
Mol. Mass.:131141.95
Organism:Homo sapiens (Human)
Description:P35228
Residue:1153
BDBM29267
BDBM10852
NameBDBM29267
Synonyms:quinolinone, 37
TypeSmall organic molecule
Emp. Form.C21H15ClFN3O2S
Mol. Mass.427.879
SMILESCc1ncsc1C(=O)N(Cc1cc(=O)[nH]c2cc(F)ccc12)c1cccc(Cl)c1