Reaction Details
TargetCholinesterase
LigandBDBM29400
Substrate/CompetitorBDBM8978
Meas. Tech.Measurement of hBuChE Activity
pH7.2±n/a
Temperature295.15±n/a K
IC50>100000±n/a nM
Citation Marco-Contelles, JLeón, Rde los Ríos, CSamadi, ABartolini, MAndrisano, VHuertas, OBarril, XLuque, FJRodríguez-Franco, MILópez, BLópez, MGGarcía, AGCarreiras Mdo, CVillarroya, M Tacripyrines, the first tacrine-dihydropyridine hybrids, as multitarget-directed ligands for the treatment of Alzheimer's disease. J Med Chem52:2724-32 (2009) 
 
Cholinesterase
Name:Cholinesterase
Type:Homotetramer
Mol. Mass.:68422.27
Organism:Homo sapiens (Human)
Description:P06276
Residue:602
BDBM29400
BDBM8978
NameBDBM29400
Synonyms:CHEMBL374184 | tacrine-dihydropyridine hybrid (tacripyrine), 11
TypeSmall organic molecule
Emp. Form.C23H27N3O3
Mol. Mass.393.4788
SMILESCCOC(=O)C1C(c2ccc(OC)cc2)c2c(N)c3CCCCc3nc2N=C1C