Reaction Details
TargetAcetylcholinesterase
LigandBDBM29396
Substrate/CompetitorBDBM10759
Meas. Tech.Measurement of hAChE Activity
IC50 91±n/a nM
Citation Marco-Contelles, JLeón, Rde los Ríos, CSamadi, ABartolini, MAndrisano, VHuertas, OBarril, XLuque, FJRodríguez-Franco, MILópez, BLópez, MGGarcía, AGCarreiras Mdo, CVillarroya, M Tacripyrines, the first tacrine-dihydropyridine hybrids, as multitarget-directed ligands for the treatment of Alzheimer's disease. J Med Chem52:2724-32 (2009) 
 
Acetylcholinesterase
Name:Acetylcholinesterase
Type:Enzyme
Mol. Mass.:71812.79
Organism:Electrophorus electricus (Electric eel)
Description:n/a
Residue:633
BDBM29396
BDBM10759
NameBDBM29396
Synonyms:CHEMBL219406 | tacrine-dihydropyridine hybrid (tacripyrine), 7
TypeSmall organic molecule
Emp. Form.C23H27N3O2
Mol. Mass.377.4794
SMILESCCOC(=O)C1C(c2ccc(C)cc2)c2c(N)c3CCCCc3nc2N=C1C