Reaction Details
TargetAcetylcholinesterase
LigandBDBM29400
Substrate/CompetitorBDBM10759
Meas. Tech.Measurement of hAChE Activity
IC50 45±n/a nM
Citation Marco-Contelles, JLeón, Rde los Ríos, CSamadi, ABartolini, MAndrisano, VHuertas, OBarril, XLuque, FJRodríguez-Franco, MILópez, BLópez, MGGarcía, AGCarreiras Mdo, CVillarroya, M Tacripyrines, the first tacrine-dihydropyridine hybrids, as multitarget-directed ligands for the treatment of Alzheimer's disease. J Med Chem52:2724-32 (2009) 
 
Acetylcholinesterase
Name:Acetylcholinesterase
Type:Enzyme
Mol. Mass.:71812.79
Organism:Electrophorus electricus (Electric eel)
Description:n/a
Residue:633
BDBM29400
BDBM10759
NameBDBM29400
Synonyms:CHEMBL374184 | tacrine-dihydropyridine hybrid (tacripyrine), 11
TypeSmall organic molecule
Emp. Form.C23H27N3O3
Mol. Mass.393.4788
SMILESCCOC(=O)C1C(c2ccc(OC)cc2)c2c(N)c3CCCCc3nc2N=C1C