Reaction Details
TargetcAMP and cAMP-inhibited cGMP 3',5'-cyclic phosphodiesterase 10A
LigandBDBM31590
Substrate/CompetitorBDBM10851
Meas. Tech.PDE Enzyme Inhibition Assay
pH7.5±n/a
Temperature296.15±n/a K
IC50 11.5±n/a nM
Citation Verhoest, PRChapin, DSCorman, MFonseca, KHarms, JFHou, XMarr, ESMenniti, FSNelson, FO'Connor, RPandit, JProulx-Lafrance, CSchmidt, AWSchmidt, CJSuiciak, JALiras, S Discovery of a Novel Class of Phosphodiesterase 10A Inhibitors and Identification of Clinical Candidate 2-[4-(1-Methyl-4-pyridin-4-yl-1H-pyrazol-3-yl)-phenoxymethyl]-quinoline (PF-2545920) for the Treatment of Schizophrenia (dagger) dagger Coordinates of the PDE10A crystal structures have been depo J Med Chem52:5188-96 (2009) 
 
cAMP and cAMP-inhibited cGMP 3',5'-cyclic phosphodiesterase 10A
Name:cAMP and cAMP-inhibited cGMP 3',5'-cyclic phosphodiesterase 10A
Type:Enzyme
Mol. Mass.:90160.88
Organism:Rattus norvegicus (rat)
Description:PDE10A was generated from the full-length recombinant rat clone transfected into Sf9 cells.
Residue:794
BDBM31590
BDBM10851
NameBDBM31590
Synonyms:pyrazole, 2
TypeSmall organic molecule
Emp. Form.C25H20N4O
Mol. Mass.392.4525
SMILESC(Oc1ccc(cc1)-c1n[nH]cc1Cc1ccncc1)c1ccc2ccccc2n1