Reaction Details
Target3-hydroxyacyl-[acyl-carrier-protein] dehydratase FabZ
LigandBDBM31931
Substrate/CompetitorBDBM8737
Meas. Tech.Enzymatic Inhibition Assay
pH8±n/a
Temperature298.15±n/a K
IC50 9920±590 nM
Comments81.4% inhibition @ 50 uM.
Citation He, LZhang, LLiu, XLi, XZheng, MLi, HYu, KChen, KShen, XJiang, HLiu, H Discovering potent inhibitors against the beta-hydroxyacyl-acyl carrier protein dehydratase (FabZ) of Helicobacter pylori: structure-based design, synthesis, bioassay, and crystal structure determination. J Med Chem52:2465-81 (2009) 
 
3-hydroxyacyl-[acyl-carrier-protein] dehydratase FabZ
Name:3-hydroxyacyl-[acyl-carrier-protein] dehydratase FabZ
Type:Lyase
Mol. Mass.:18198.05
Organism:Helicobacter pylori (Campylobacter pylori)
Description:HpfabZ is expressed and purified from E. coli.
Residue:159
BDBM31931
BDBM8737
NameBDBM31931
Synonyms:carbohydrazide derivative, 3n
TypeSmall organic molecule
Emp. Form.C15H12Br2N2O4
Mol. Mass.444.075
SMILESCOc1ccc(cc1)C(=O)N\N=C\c1cc(Br)c(O)c(Br)c1O