Reaction Details
Target11-beta-hydroxysteroid dehydrogenase 1 [24-292,C272S]
LigandBDBM32574
Substrate/CompetitorBDBM13739
Meas. Tech.Human 11beta-HSD1 SPA Assay
IC50 29±n/a nM
EC50 527±n/a nM
Citation Sun, DWang, ZDi, YJaen, JCLabelle, MMa, JMiao, SSudom, ATang, LTomooka, CSTu, HUrsu, SWalker, NYan, XYe, QPowers, JP Discovery and initial SAR of arylsulfonylpiperazine inhibitors of 11beta-hydroxysteroid dehydrogenase type 1 (11beta-HSD1). Bioorg Med Chem Lett18:3513-6 (2008) 
 
11-beta-hydroxysteroid dehydrogenase 1 [24-292,C272S]
Name:11-beta-hydroxysteroid dehydrogenase 1 [24-292,C272S]
Type:Homodimer
Mol. Mass.:31804.08
Organism:Homo sapiens (Human)
Description:Purified recombinant human 11beta-HSD1.
Residue:286
BDBM32574
BDBM13739
NameBDBM32574
Synonyms:arylsulfonylpiperazine, 46
TypeSmall organic molecule
Emp. Form.C21H27N3O4S
Mol. Mass.417.522
SMILESC[C@H]1CN(CCN1S(=O)(=O)c1ccc(cc1)C(C)(C)C)c1ccc(cc1)[N+]([O-])=O