Reaction Details
TargetGenome polyprotein [1393-1439,E1407V]/[1476-1660,R1508K,A1566M]
LigandBDBM33251
Substrate/CompetitorBDBM33248
Meas. Tech.Enzyme Inhibition Assay
pH7.5±n/a
Temperature310.15±n/a K
IC50 2000±n/a nM
CommentsHill slope=2.4
Citation Bodenreider, CBeer, DKeller, THSonntag, SWen, DYap, LYau, YHShochat, SGHuang, DZhou, TCaflisch, ASu, XCOzawa, KOtting, GVasudevan, SGLescar, JLim, SP A fluorescence quenching assay to discriminate between specific and nonspecific inhibitors of dengue virus protease. Anal Biochem395:195-204 (2009) 
 
Genome polyprotein [1393-1439,E1407V]/[1476-1660,R1508K,A1566M]
Name:Genome polyprotein [1393-1439,E1407V]/[1476-1660,R1508K,A1566M]
Synonyms:Dengue Virus 1 (DENV1) NS2B-NS3 Protease
Type:Cofactor/Enzyme
Mol. Mass.:n/a
Description:n/a
Components:This complex has 2 components.
Component 1
Name:Genome polyprotein [1393-1439,E1407V]
Type:Cofactor Domain
Mol. Mass.:5202.48
Organism:Dengue virus 1(Hawaii)
Description:P33478[1393-1439,E1407V]
Residue:47
adlslek aaevswevea ehsgashnil vevqddgtmk ikdeerddtl
Component 2
Name:Genome polyprotein [1476-1660,R1508K,A1566M]
Synonyms:Flavivirus NS3 serine protease POLG_DEN1W
Type:Catalytic Domain
Mol. Mass.:19899.28
Organism:Dengue virus 1(Hawaii)
Description:P17763[1476-1660,R1508K,A1566M]
Residue:185
BDBM33251
BDBM33248
NameBDBM33251
Synonyms:phthalazine-based compound, 2
TypeSmall organic molecule
Emp. Form.C29H24N6
Mol. Mass.456.5411
SMILESC1CN=C(N1)c1ccc(Nc2nnc(Nc3ccc(cc3)-c3ccccc3)c3ccccc23)cc1