Reaction Details
TargetNAD(P)H dehydrogenase [quinone] 1
LigandBDBM35525
Substrate/CompetitorBDBM24778
Meas. Tech.Inhibition of NQO1 (With 2 uM BSA)
pH7.5±n/a
Temperature298.15±n/a K
IC50 404±184 nM
Citation Nolan, KADoncaster, JRDunstan, MSScott, KAFrenkel, ADSiegel, DRoss, DBarnes, JLevy, CLeys, DWhitehead, RCStratford, IJBryce, RA Synthesis and biological evaluation of coumarin-based inhibitors of NAD(P)H: quinone oxidoreductase-1 (NQO1). J Med Chem52:7142-56 (2009) 
 
NAD(P)H dehydrogenase [quinone] 1
Name:NAD(P)H dehydrogenase [quinone] 1
Type:Homodimer
Mol. Mass.:30874.82
Organism:Homo sapiens (Human)
Description:n/a
Residue:274
BDBM35525
BDBM24778
NameBDBM35525
Synonyms:3,3''''-methylenebis(4-hydroxy-coumarin 3,3''''-methylenebis[4-hydroxycoumarin Bishydroxycoumarin DICUMAROL symmetric dicoumarol analogue, 1
TypeSmall organic molecule
Emp. Form.C19H12O6
Mol. Mass.336.295
SMILESOc1c(Cc2c(O)c3ccccc3oc2=O)c(=O)oc2ccccc12