Reaction Details
TargetNAD(P)H dehydrogenase [quinone] 1
LigandBDBM35534
Substrate/CompetitorBDBM24778
Meas. Tech.Inhibition of NQO1 (With 2 uM BSA)
pH7.5±n/a
Temperature298.15±n/a K
IC50 233±68 nM
Citation Nolan, KADoncaster, JRDunstan, MSScott, KAFrenkel, ADSiegel, DRoss, DBarnes, JLevy, CLeys, DWhitehead, RCStratford, IJBryce, RA Synthesis and biological evaluation of coumarin-based inhibitors of NAD(P)H: quinone oxidoreductase-1 (NQO1). J Med Chem52:7142-56 (2009) 
 
NAD(P)H dehydrogenase [quinone] 1
Name:NAD(P)H dehydrogenase [quinone] 1
Type:Homodimer
Mol. Mass.:30874.82
Organism:Homo sapiens (Human)
Description:n/a
Residue:274
BDBM35534
BDBM24778
NameBDBM35534
Synonyms:symmetric dicoumarol analogue, 10
TypeSmall organic molecule
Emp. Form.C23H20O6
Mol. Mass.392.4013
SMILESCc1cc2oc(=O)c(Cc3c(O)c4cc(C)c(C)cc4oc3=O)c(O)c2cc1C