Reaction Details
TargetNAD(P)H dehydrogenase [quinone] 1
LigandBDBM35530
Substrate/CompetitorBDBM24778
Meas. Tech.Inhibition of NQO1 (With 2 uM BSA)
pH7.5±n/a
IC50 4.5±n/a nM
Commentsextracted
Citation Nolan, KADoncaster, JRDunstan, MSScott, KAFrenkel, ADSiegel, DRoss, DBarnes, JLevy, CLeys, DWhitehead, RCStratford, IJBryce, RA Synthesis and biological evaluation of coumarin-based inhibitors of NAD(P)H: quinone oxidoreductase-1 (NQO1). J Med Chem52:7142-56 (2009) 
 
NAD(P)H dehydrogenase [quinone] 1
Name:NAD(P)H dehydrogenase [quinone] 1
Type:Homodimer
Mol. Mass.:30874.82
Organism:Homo sapiens (Human)
Description:n/a
Residue:274
BDBM35530
BDBM24778
NameBDBM35530
Synonyms:symmetric dicoumarol analogue, 6
TypeSmall organic molecule
Emp. Form.C19H10F2O6
Mol. Mass.372.2759
SMILESOc1c(Cc2c(O)c3cc(F)ccc3oc2=O)c(=O)oc2ccc(F)cc12