Reaction Details
TargetVasopressin V1a receptor
LigandBDBM35723
Substrate/CompetitorBDBM35667
Meas. Tech.Radioligand Binding Assay to HeLa Cells
pH7.4±n/a
Temperature277.15±n/a K
IC50 580±n/a nM
Citation Kondo, KOgawa, HYamashita, HMiyamoto, HTanaka, MNakaya, KKitano, KYamamura, YNakamura, SOnogawa, TMori, TTominaga, M 7-Chloro-5-hydroxy-1-[2-methyl-4-(2-methylbenzoyl-amino)benzoyl ]-2,3,4,5-tetrahydro-1H-1-benzazepine (OPC-41061): a potent, orally active nonpeptide arginine vasopressin V2 receptor antagonist. Bioorg Med Chem7:1743-54 (1999) 
 
Vasopressin V1a receptor
Name:Vasopressin V1a receptor
Type:Receptor
Mol. Mass.:46820.18
Organism:Homo sapiens (Human)
Description:P37288
Residue:418
BDBM35723
BDBM35667
NameBDBM35723
Synonyms:CHEMBL344159 TOLVAPTAN | benzazepine derivative, 32
TypeSmall organic molecule
Emp. Form.C26H25ClN2O3
Mol. Mass.448.941
SMILESCc1ccccc1C(=O)Nc1ccc(C(=O)N2CCCC(O)c3cc(Cl)ccc23)c(C)c1