Reaction Details
TargetCoagulation factor X
LigandBDBM35773
Substrate/CompetitorBDBM12658
Meas. Tech.Enzyme Inhibition Assay
pH7.4±n/a
Temperature296.15±n/a K
IC50 3.4±n/a nM
Citation Yoshikawa, KKobayashi, SNakamoto, YHaginoya, NKomoriya, SYoshino, TNagata, TMochizuki, AWatanabe, KSuzuki, MKanno, HOhta, T Design, synthesis, and SAR of cis-1,2-diaminocyclohexane derivatives as potent factor Xa inhibitors. Part II: exploration of 6-6 fused rings as alternative S1 moieties. Bioorg Med Chem17:8221-33 (2009) 
 
Coagulation factor X
Name:Coagulation factor X
Type:Enzyme
Mol. Mass.:54726.60
Organism:Homo sapiens (Human)
Description:n/a
Residue:488
BDBM35773
BDBM12658
NameBDBM35773
Synonyms:cis-1,2-diaminocyclohexane derivative, 48
TypeSmall organic molecule
Emp. Form.C25H29ClN6O3S
Mol. Mass.529.054
SMILESCN(C)C(=O)[C@H]1CC[C@H](NC(=O)c2cc3cc(Cl)ccc3[nH]2)[C@@H](C1)NC(=O)c1nc2CN(C)Cc2s1