Reaction Details
TargetBeta-secretase 1
LigandBDBM195181
Substrate/Competitorn/a
Meas. Tech.BACE Assay
IC50 3.50±n/a nM
Citation Cacatian, SClaremon, DADillard, LWFuchs, KHeine, NJia, LLeftheris, KMcKeever, BMorales-Ramos, ASingh, SBVenkatraman, SWu, GWu, ZXu, ZYuan, JZheng, Y Inhibitors of beta-secretase US Patent US10336717 Publication Date 7/2/2019
 
Beta-secretase 1
Name:Beta-secretase 1
Type:Protein
Mol. Mass.:55755.10
Organism:Homo sapiens (Human)
Description:P56817
Residue:501
BDBM195181
NameBDBM195181
Synonyms:US10336717, Compound 244 | US9212153, 244,Ex. 199
TypeSmall organic molecule
Emp. Form.C22H29N3O3
Mol. Mass.383.484
SMILESCOC1CCC2(Cc3ccc(OCC4CC4)cc3C22N=C(N)N(C)C2=O)CC1