Reaction Details
TargetSerine/threonine-protein kinase ATR
LigandBDBM268001
Substrate/Competitorn/a
Meas. Tech.Time-Resolved Fluorescence Energy Transfer (TR-FRET Tracer A)
pH7±n/a
IC50 19.8±n/a nM
Commentsextracted
Citation Wortmann, LLücking, ULefranc, JBriem, HVon Nussbaum, FBader, BSiemeister, GBone, WLienau, PMoosmayer, DEberspächer, USchick, HEis, KKoppitz, MWengner, AMGrudzinska-Goebel, J 2-(morpholin-4-yl)-1,7-naphthyridines US Patent US9549932 Publication Date 1/24/2017
 
Serine/threonine-protein kinase ATR
Name:Serine/threonine-protein kinase ATR
Type:Protein
Mol. Mass.:301404.58
Organism:Homo sapiens (Human)
Description:Q13535
Residue:2644
BDBM268001
NameBDBM268001
Synonyms:2-[(3R)-3-methylmorpholin-4-yl]-4-(methylsulfonyl)-8-(1H-pyrazol-5-yl)-1,7-naphthyridine | US9549932, 33
TypeSmall organic molecule
Emp. Form.C22H27N5O4S
Mol. Mass.457.546
SMILESC[C@@H]1COCCN1c1cc(c2ccnc(-c3ccnn3C3CCCCO3)c2n1)S(C)(=O)=O